ذخیره‌ساز مغناطیسی
type: Concept
broader: ذخیره‌ساز
preferred label: magnetic storage device @en

ذخیره‌ساز
type: Concept
narrower: ذخیره‌ساز مغناطیسی
preferred label: storage device @en
scope note: محل ذخیره‌سازی دائمی یا نیمه‌دائمی داده‌های رقمی، که بیشتر به دیسک یا نوار اطلاق می‌شود.