پوش‌رنگ جلبک‌کش
type: Concept
broader: پوش‌رنگ
preferred label: algicidal paint @en
scope note: ماده‌ای پوششی با افزودنی‌های خاصی که مانع رشد جلبک بر سطح آن می‌شود.

پوش‌رنگ
type: Concept
narrower: پوش‌رنگ جلبک‌کش
preferred label: paint @en