کشتی
type: Concept
preferred label: ship @en
related: پوش‌رنگ بدنه کشتی

پوش‌رنگ بدنه کشتی
type: Concept
broader: پوش‌رنگ
preferred label: hull paint @en
related: کشتی
scope note: رنگی که بر روی بدنۀ کشتی، به‌ویژه بخش زیرین خط آب‌خور کشتی، زده می‌شود.

پوش‌رنگ
type: Concept
narrower: پوش‌رنگ بدنه کشتی
preferred label: paint @en