پوش‌رنگ چندرنگ
type: Concept
broader: پوش‌رنگ
preferred label: multicolour paint @en
scope note: ماده‌ای پوششی که پس از استفاده، ظاهری با خال‌ها یا رگه‌های رنگارنگ پیدا می‌کند.

پوش‌رنگ
type: Concept
narrower: پوش‌رنگ چندرنگ
preferred label: paint @en