جوشکاری لب‌به‌لب
type: Concept
broader: جوشکاری
preferred label: butt welding @en
scope note: روشی در جوشکاری که در آن دو لبۀ قطعات کار در مقابل هم و تحت فشار قرار می‌گیرند و خط تماس آنها جوش داده میشود.

جوشکاری
type: Concept
narrower: جوشکاری لب‌به‌لب
preferred label: welding @en