جوشکاری مقاومتی درزی
type: Concept
broader: جوشکاری مقاومتی
preferred label: resistance seam welding @en
scope note: نوعی جوشکاری مقاومتی که در آن اتصال جوش به‌صورت درز است.

جوشکاری مقاومتی
type: Concept
narrower: جوشکاری مقاومتی درزی
preferred label: resistance welding @en