جوشکاری ذوبی
type: Concept
broader: جوشکاری
preferred label: fusion welding @en
related: ذوب
scope note: اتصال دولبه فلزى به یکدیگر که با ذوب کردن مستقیم آنها صورت می‌گیرد و دو فلز در هم نفوذ می‌کنند.

جوشکاری
type: Concept
narrower: جوشکاری ذوبی
preferred label: welding @en

ذوب
type: Concept
preferred label: melting @en
related: جوشکاری ذوبی