جوشکاری قوسی‌کربنی
type: Concept
broader: جوشکاری قوسی
preferred label: carbon arc welding @en
scope note: نوعی فرایند جوشکاری که در آن قوس الکتریکی میان دو الکترود کربنی یا میان یک الکترود کربنی و قطعۀ جوش‌دادنی ایجاد میشود.

جوشکاری قوسی
type: Concept
narrower: جوشکاری قوسی‌کربنی
preferred label: arc welding @en