جوشکاری قوسی تنگستنی-گازمحافظ
type: Concept
broader: جوشکاری قوسی
preferred label: gas tungsten arc welding @en
scope note: نوعی جوشکاری قوسی که در آن بین الکترود تنگستنی غیرمصرفی و حوضچۀ جوش قوس ایجاد می‌شود و حفاظت از فلز مذاب با استفاده از گاز خنثی انجام می‌شود.

جوشکاری قوسی
type: Concept
narrower: جوشکاری قوسی تنگستنی-گازمحافظ
preferred label: arc welding @en