جوشکاری نوردی
type: Concept
broader: جوشکاری حالت‌جامد
preferred label: roll welding @en
scope note: نوعی جوشکاری حالت‌جامد با استفاده از اعمال گرما و فشار به‌وسیلۀ غلتک‌هایی که موجب تغییر شکل فلز در سطح تماس می‌شوند.

جوشکاری حالت‌جامد
type: Concept
narrower: جوشکاری نوردی
preferred label: solid-state welding @en