بازشناسی نشانه
type: Concept
alternative label: شناسایی نشانه
broader: بازشناسی الگو
preferred label: target recognition @en
scope note: فرایندی که در آن نشانه‌های تصویری براساس یک قاعدۀ تصمیم‌گیری مشخص شناسایی می‌شود.

بازشناسی الگو
type: Concept
narrower: بازشناسی نشانه
preferred label: pattern recognition @en