ترابرد پیرایاخته‌ای
type: Concept
broader: ترابرد یاخته‌ای
preferred label: paracellular transport @en
scope note: جابه‌جایی مواد ازطریق لایه‌های یاخته‌ای با عبور از فضاهای بینِ‌یاخته‌ای

ترابرد یاخته‌ای
type: Concept
narrower: ترابرد پیرایاخته‌ای
preferred label: cellular transport @en