dislocation scattering
type: Concept
alternative label: carrier scattering by dislocation
alternative label: پراکندگی حامل با درفتگی @fa
broader: transport process
preferred label: پراکندگی دررفتگی @fa
scope note: used for carrier scattering by dislocation

transport process
type: Concept
narrower: dislocation scattering
preferred label: فرایند ترابرد @fa