اخترفیزیک
type: Concept
broader: اخترشناسی
preferred label: astrophysics @en
scope note: بررسی سرشت فیزیکی عالم و اجسام آن، به‌ویژه ستارگان و کهکشان‌ها، و شناسایی ترکیب فضای بین آنها

اخترشناسی
type: Concept
narrower: اخترفیزیک
preferred label: astronomy @en