nuclear transition probabilities
type: Concept
broader: nuclear energy level lifetimes
preferred label: احتمال گذار هسته‌ای @fa

nuclear energy level lifetimes
type: Concept
broader: nuclear energy level transition
narrower: nuclear transition probabilities
preferred label: عمر تراز انرژی هسته‌ای @fa
scope note: not to be used for radioactive lifetimes - used for gamma decay lifetimes or half lives

nuclear energy level transition
type: Concept
narrower: nuclear energy level lifetimes
preferred label: گذار تراز انرژی هسته‌ای @fa