خط انتقال توان حلقوی
type: Concept
broader: خط انتقال توان
preferred label: ring power-transmission line @en
scope note: خط انتقال توانی که چند نقطۀ بار یا توزیع را به شکل دایره به هم وصل می‌کند.

خط انتقال توان
type: Concept
narrower: خط انتقال توان حلقوی
preferred label: power transmission line @en