برش‌نگاری بازتابی
type: Concept
broader: برش‌نگاری
preferred label: reflection tomography @en
scope note: نوعی برش‌نگاری بر پایۀ داده‌های لرزه‌ای بازتابی سطح‌به‌سطح

برش‌نگاری
type: Concept
narrower: برش‌نگاری بازتابی
preferred label: tomography @en