برش‌نگاری زمان‌سیری
type: Concept
broader: برش‌نگاری
preferred label: traveltime tomography @en
scope note: روشی برای یافتن مدل توزیع سرعت در زمین با به‌کارگیری زمان سیرهای قرائت‌شده

برش‌نگاری
type: Concept
narrower: برش‌نگاری زمان‌سیری
preferred label: tomography @en