ناوردایی وارونی زمان
type: Concept
broader: ناوردایی
preferred label: time-reversal invariance @en
scope note: اصلی که براساس آن کمیت فیزیکی براثر وارونی زمان بدون تغییر می‌ماند.

ناوردایی
type: Concept
narrower: ناوردایی وارونی زمان
preferred label: invariance @en