تلسکوپ نیوتونی ـ کاسگرینی
type: Concept
broader: تلسکوپ کاسگرینی
preferred label: Newtonian-Cassegrain telescope @en
scope note: نوعی تلسکوپ کاسگرینی دارای آینۀ تخت و قائمی که مانع از هم‌گرایی باریکۀ نور آینۀ ثانویه می‌شود و آن را به سمت لولۀ تلسکوپ (tube) هدایت می‌کند.

تلسکوپ کاسگرینی
type: Concept
narrower: تلسکوپ نیوتونی ـ کاسگرینی
preferred label: Cassegrain telescope @en