تقلب رایانه‌ای
type: Concept
broader: تقلب
preferred label: computer fraud @en
scope note: هرنوع دستکاری در سامانه‌های رایانه‌ای برای سوءاستفاده یا فریبکاری

تقلب
type: Concept
narrower: تقلب رایانه‌ای
preferred label: fraud @en