صافش تماسی
type: Concept
broader: صافش
preferred label: contact filtration @en
scope note: نوعی فرایند جداسازی که در آن ذرات جاذب با مایع مخلوط و پس از جذب مواد مورد نظر، مایع صاف می‌شود.

صافش
type: Concept
narrower: صافش تماسی
preferred label: filtration @en