نهان‌نگاری صوتی
type: Concept
broader: نهان‌نگاری
preferred label: audio steganography @en
scope note: جا دادن پیغام محرمانه در نشانک‌های صوتی رقمی

نهان‌نگاری
type: Concept
narrower: نهان‌نگاری صوتی
preferred label: steganography @en