نهان‌نگاری محاسباتی‌‌امن
type: Concept
broader: نهان‌نگاری
preferred label: computationally secure steganography @en
scope note: نوعی خوارزمی/ الگوریتم نهان‌نگاری که مهـاجـم بـا در اختـیـار داشـتـن یـک خوارزمی/ الگوریتم محاسباتی زمان‌چندجمله‌ای (polynomial-time comutable algorithm) احتمالاتی تنها بتواند تمایز ناچیزی بین پوشانه و نهانه پیدا کند.

نهان‌نگاری
type: Concept
narrower: نهان‌نگاری محاسباتی‌‌امن
preferred label: steganography @en