نهان‌نگاری رقمی
type: Concept
broader: نهان‌نگاری
preferred label: digital steganography @en
scope note: پنهان کردن اطلاعات رقمی ازطریق درج داده‌های پیغام محرمانه در داخل داده‌های پیغام عادی

نهان‌نگاری
type: Concept
narrower: نهان‌نگاری رقمی
preferred label: steganography @en