نهان‌نگاری زبانی
type: Concept
broader: نهان‌نگاری
preferred label: linguistic steganography @en
scope note: هنر پنهان کردن اطلاعات با استفاده از روش‌ها و قواعد زبانی

نهان‌نگاری
type: Concept
narrower: نهان‌نگاری زبانی
preferred label: steganography @en