نهان‌نگاری تصویرساکن
type: Concept
broader: نهان‌نگاری
preferred label: still imagery steganography @en
scope note: پنهان کردن پیام محرمانه در داخل تصاویر رقمی

نهان‌نگاری
type: Concept
narrower: نهان‌نگاری تصویرساکن
preferred label: steganography @en