نهان‌نگاری تصویر‌متحرک
type: Concept
broader: نهان‌نگاری
preferred label: video steganography @en
scope note: ارسال پیام محرمانه با استفاده از داده‌های ویدیویی به‌عنوان رسانۀ پوششی

نهان‌نگاری
type: Concept
narrower: نهان‌نگاری تصویر‌متحرک
preferred label: steganography @en