soil
type: Concept
preferred label: خاک @fa
related: erosion

geomorphology
type: Concept
preferred label: زمین‌ریخت‌شناسی @fa
related: erosion

erosion
type: Concept
alternative label: weathering, rocks
preferred label: فرسایش @fa
related: geomorphology
related: soil
scope note: used for natural phenomenon. For materials science aspects use "wear"
scope note: فرایندی کلی یا گروهی از فرایندها که در آن مواد تشکیل‌دهندۀ پوستۀ زمین‌ سست یا حل یا ساییده می‌شوند و هم‌زمان براثر عوامل طبیعی از نقطه‌ای به ‌نقطۀ دیگر منتقل می‌شوند. @fa