تردش قلیایی
type: Concept
broader: تردش
preferred label: caustic embrittlement @en
scope note: شکست فلزات در محلول‌های قلیایی به‌موجب تأثیر هم‌زمـان خوردگی و تنش کششی

تردش
type: Concept
narrower: تردش قلیایی
preferred label: embrittlement @en