پیوند شیمیایی
type: Concept
preferred label: bonds (chemical) @en
related: الکترون‌کشانی

پتانسیل یونش
type: Concept
preferred label: ionization potential @en
related: الکترون‌کشانی

الکترون‌کشانی
type: Concept
preferred label: electronegativity @en
related: پیوند شیمیایی
related: پتانسیل یونش
scope note: توانایی نسبی اتم در پیوند شیمیایی برای جذب الکترون‌های مشترک