الکتروجت استوایی
type: Concept
broader: الکتروجت
preferred label: equatorial electrojet @en
scope note: تمرکز جریان الکتریکی جوّ در استوای مغناطیسی

الکتروجت
type: Concept
narrower: الکتروجت استوایی
preferred label: electrojet @en