گردوخاک گسترده
type: Concept
broader: گردوخاک
preferred label: widespread dust @en
scope note: ذرات ریز گردوخاک معلق در هوا که از زمین برخاسته و در منقطه‌ای پهناور پخش شده‌ باشد.

گردوخاک
type: Concept
narrower: گردوخاک گسترده
preferred label: dust @en