مه سردباد
type: Concept
broader: مه
preferred label: bora fog @en
scope note: مِه غلیظ ناشی از فوران قطرک‌ها از سطح آب دریا براثر وزش سردباد

مه
type: Concept
narrower: مه سردباد
preferred label: fog @en