مه تابشی
type: Concept
broader: مه
preferred label: radition fog @en
scope note: نوع معمول مِه که براثر سرمایش تابشی شبانۀ سطح زمین و کاهش دمای هوا تا نقطۀ شبنم یا پایین‌تر از آن تشکیل می‌شود.

مه
type: Concept
narrower: مه تابشی
preferred label: fog @en