optical code division multiple access
type: Concept
alternative label: ODMA
broader: code division multiple access
preferred label: دسترسی چندگانه کدتقسیم نوری @fa
scope note: نسخۀ شبیه‌سازی‌شدۀ فنّاوری دسترسی چندگانۀ کدتقسیم برای شبکه‌های نوری @fa

code division multiple access
type: Concept
narrower: optical code division multiple access
preferred label: دسترسی چندگانه کدتقسیم @fa