wideband code division multiple access
type: Concept
alternative label: W-CDMA
broader: code division multiple access
preferred label: دسترسی چندگانه کدتقسیم پهن‌باند @fa
scope note: نسل سوم فنّاوری بی‌سیم همراه که سرعت استاندارد آن معادل چهار برابر سرعت داده‌ای است که در شبکه‌های دوگیگی به کار می‌رود. @fa

code division multiple access
type: Concept
narrower: wideband code division multiple access
preferred label: دسترسی چندگانه کدتقسیم @fa