فرهنگ دوزبانه
type: Concept
alternative label: واژه‌نامه دوزبانه
broader: فرهنگ
preferred label: bilingual dictionary @en
scope note: فرهنگ یا واژه‌نامه‌ای که به دو زبان نوشته شده باشد.

فرهنگ
type: Concept
narrower: فرهنگ دوزبانه
preferred label: dictionary @en