فرهنگ چندزبانه
type: Concept
alternative label: واژه‌نامه چندزبانه
broader: فرهنگ
preferred label: multilingual dictionary @en
scope note: فرهنگ یا واژه‌نامه‌ای که به بیش از دو زبان نوشته شده باشد.

فرهنگ
type: Concept
narrower: فرهنگ چندزبانه
preferred label: dictionary @en