فرهنگ زانسو
type: Concept
broader: فرهنگ
preferred label: reverse dictionary @en
scope note: گونه‌ای کتاب مرجع که در آن واژه‌ها به شیوۀ الفبایی از حرف آخر به حرف اول مرتب شده است.

فرهنگ
type: Concept
narrower: فرهنگ زانسو
preferred label: dictionary @en