برشکاری قوسی کربنی
type: Concept
broader: برشکاری قوسی
preferred label: carbon arc cutting @en
scope note: نوعی برشکاری قوسی که در آن از الکترود کربنی استفاده می‌شود.

برشکاری قوسی
type: Concept
narrower: برشکاری قوسی کربنی
preferred label: arc cutting @en