برشکاری قوسی
type: Concept
broader: برشکاری گرمایی
preferred label: arc cutting @en

برشکاری گرمایی
type: Concept
broader: برشکاری
narrower: برشکاری قوسی
preferred label: thermal cutting @en
scope note: نوعی برشکاری که در آن عمل برش با ذوب فلز پایه و زدودن مذاب انجام می‌شود.

برشکاری
type: Concept
narrower: برشکاری گرمایی
preferred label: cutting @en