بلور مکعبی تنگ‌چین
type: Concept
broader: بلور تنگ‌چین
preferred label: cubic close-packed crystal @en
scope note: آرایش خاصی از چهار لایۀ تنگ‌چین که می‌توان آن را به ساختار مکعبی مرکزوجهی تبدیل کرد.

بلور تنگ‌چین
type: Concept
narrower: بلور مکعبی تنگ‌چین
preferred label: close-packed crystal @en