واپایش نوفه فعال
type: Concept
broader: واپایش نوفه
preferred label: active noise control @en

واپایش نوفه
type: Concept
alternative label: کنترل نوفه
broader: واپایش متغیرهای آکوستیکی
narrower: واپایش نوفه فعال
preferred label: noise control @en
scope note: فرایندی که نوفه را در محل تولید یا دریافت آن به سطح قابل‌قبول می‌رساند. @en

واپایش متغیرهای آکوستیکی
type: Concept
narrower: واپایش نوفه
preferred label: acoustic variables control @en