واپایشگر الکتریکی
type: Concept
broader: واپایشگر
preferred label: electrical controller @en
scope note: وسیله‌ای برای تنظیم مقدار توان الکتریکی ورودی به دستگاه برقی

واپایشگر
type: Concept
narrower: واپایشگر الکتریکی
preferred label: controller @en