واپایشگر رقمی‌ـ‌ الکترونیکی تمام‌اختیار
type: Concept
alternative label: فاتا
broader: واپایشگر
preferred label: full-authority digital electronic control @en
scope note: دستگاه تنظیم الکترونیکی سوخت در موتورهای توربین گازی که سوخت ورودی به موتور را در کل سامانۀ عملکرد موتور تنظیم می‌کند و سلامت موتور و مؤلفه‌های عملیاتی حیاتی آن را نیز پایش می‌کند.

واپایشگر
type: Concept
narrower: واپایشگر رقمی‌ـ‌ الکترونیکی تمام‌اختیار
preferred label: controller @en