پایدارساز ساحلی
type: Concept
broader: واپایشگر
preferred label: hard stabilisation @en
scope note: هرنوع سازه که برای حفاظت از ساحل یا ممانعت از حرکت شن و ماسه در امتداد ساحل ساخته میشود.

واپایشگر
type: Concept
narrower: پایدارساز ساحلی
preferred label: controller @en