ثابت ناهمسانگردی
type: Concept
broader: ثابت
preferred label: anisotropy constant @en
scope note: پارامتری وابسته ‌به‌ دما در مادۀ فرّومغناطیسی که بیانگر رابطۀ مغناطش در جهت‌های مختلف و انرژی ناهمسانگردی است.

ثابت
type: Concept
narrower: ثابت ناهمسانگردی
preferred label: constant @en