ثابت جفت‌شدگی
type: Concept
broader: ثابت
preferred label: coupling constant @en
scope note: برهم‌کنش هسته‌ها در تشدید مغناطیسی هسته که با نماد J نشان داده می‌شود.

ثابت
type: Concept
narrower: ثابت جفت‌شدگی
preferred label: constant @en