ثابت ‌زم‌سنجی
type: Concept
broader: ثابت
preferred label: cryoscopic constant @en
scope note: ثابت معادله‌ای که نشان‌دهندۀ میزان نزول نقطۀ انجماد براثر حل‌کردن یک مول مادۀ محلول در یک لیتر حلاّل است.

ثابت
type: Concept
narrower: ثابت ‌زم‌سنجی
preferred label: constant @en